{"text_format":"1","workbook":"xlsx","n_sheets":7,"sheets":["laroux","Gösterge ve Ek Gösterg Oranları","Temel Maaş Verileri","Özel Hizmet Tazminatları","SGY","Veriler","Bordro"],"not_rendered":{"charts":0,"images":0,"macros":1,"external_links":1,"defined_names":5,"comments":0,"pivot_tables":0},"unopened":[],"bounds":{"document_bytes":16777216,"sheet_cells":100000,"rows_first":2000,"rows_last":500,"rows_between":2000,"halvings":0,"cell_chars":16384,"cell_head_chars":4096},"cells_cut":0,"cells_raw":0,"read":"whole","date_system":"1900"}

{"sheet":"laroux","index":0,"n_rows":0,"n_cols":0,"rows_kept":0,"cut":false,"hidden":true,"merged":[]}

{"sheet":"Gösterge ve Ek Gösterg Oranları","index":1,"n_rows":36,"n_cols":14,"rows_kept":36,"cut":false,"hidden":true,"merged":[]}
[]
[1,3000,null,null,1,2,3,4,5,6,7,8,9,"Gösterge Maaşı"]
[2,2200,null,1,1320,1380,1440,1500,"-","-","-","-","-","Ek Gösterge Maaşı"]
[3,1600,null,2,1155,1210,1265,1320,1380,1440,"-","-","-","Kıdem Aylık"]
[4,1100,null,3,1020,1065,1110,1155,1210,1265,1320,1380,"-","Taban Aylık"]
[5,900,null,4,915,950,985,1020,1065,1110,1155,1210,1265,"Yan Ödeme"]
[6,800,null,5,835,865,895,915,950,985,1020,1065,1110,"Ek Ödeme"]
[7,500,null,6,760,785,810,835,865,895,915,950,985,"Özel Hizmet Tazminatı (Alan Süre)"]
[8,450,null,7,705,720,740,760,785,810,835,865,895,"Çocuk Yardımı (Altı Yaş Altı)"]
[9,0,null,8,660,675,690,705,720,740,760,785,810,"Özel Hizmet Tazminatı(Dereceye Göre)"]
[10,0,null,9,620,630,645,660,675,690,705,720,740,"Çocuk Yardımı (Altı Yaş Üstü)"]
[11,0,null,10,590,600,610,620,630,645,660,675,690,"Eş Yardımı"]
[12,0,null,11,560,570,580,590,600,610,620,630,645,"Dil Tazminatı"]
[13,0,null,12,545,550,555,560,570,580,590,600,610,"Sendika Primi-Devlet Verecek"]
[14,0,null,13,530,535,540,545,550,555,560,570,580,"Özel Hizmet Tazminatı(Kariyere Göre)"]
[15,0,null,14,515,520,525,530,535,540,545,550,555,"İlaç kesintisi"]
[null,null,null,15,500,505,510,515,520,525,530,535,540,"AGİ"]
[]
[]
[]
[]
[]
[]
[]
[null,null,null,null,null,null,null,null,null,null,null,null,null,"Emekli Keseneği İçin Maaş"]
[null,null,null,null,null,null,null,null,null,null,null,null,null,"EYDMM"]
[null,null,null,null,null,null,null,null,null,null,null,null,null,"Emeklilik Keseneği"]
[]
[null,null,null,null,null,null,null,null,null,null,null,null,null,"Toplam Çocuk Sayısı"]
[null,null,null,null,null,null,null,null,null,null,null,null,null,"Emeklilik Keseneği (Kişi)"]
{"$rows_left_out":7}
{"sheet":"Temel Maaş Verileri","index":2,"n_rows":33,"n_cols":196,"rows_kept":33,"cut":false,"hidden":true,"merged":[]}
["Maaş Temel Verileri\n(Maaşınızın doğru hesaplanması bu verilerin güncel olmasına bağlıdır.)"]
["Aylık Katsayı"]
["Taban Aylık Katsayısı"]
["Yan Ödeme Katsayıs"]
["Asgari Ücret"]
["Sendika Yardımı"]
[]
["Dereceler",15,14,13,12,11,10,9,8,7,6,5,4,3,2,1]
["Kademeler/Kıdem Yılı",1,2,3,4,5,6,7,8,9,10,11,12,13,14,15,16,17,18,19,20,21,22,23,24,25,26,27,28,29,30,31,32,33,34,35,36,37,38,39,40]
["Kariyer Basamakları","Öğretmen","Uzman Öğretmen","Baş Öğretmen"]
["Ek Ödeme Katsayıları",0.51,0.52,0.53,0.54,0.55000000000000004,0.56999999999999995,0.63,0.64,0.65,0.66,0.67,0.68,0.7,0.72,0.74,0.75,0.76,0.77,0.82,0.83,0.91,0.96,1.1200000000000001]
["Vergi Dilimleri",0.15,0.2,0.27]
["Eş Durumu","Bekar","Evli Eş Çalışıyor","Evli Eş Çalışmıyor","Evli Eş Emekli"]
["Sendika Durumu","Üye Değilim","Üyeyim","Üyeyim-Sendika Yardımı Alıyor"]
["İlksan","Üye Değilim","Üyeyim","Derece Terfi*2"]
["Çocuk Sayısı (Altı Yaş Üstü)","Yok",1,2,3,4,5,6,7,8,9,10]
["Çocuk Katsayıları (Altı Yaş Üstü)",0,250,500,750,1000,1250,3000,3500,4000,4500,5000]
["Çocuk Sayısı (Altı Yaş Altı)","Yok",1,2,3,4,5,6,7,8,9,10]
["Çocuk Katsayıları (Altı Yaş Altı)",0,500,1000,1500,2000,2500,3000,3500,4000,4500,5000]
["Dil Tazminatı","Yok","A:96-100","A:90-95","B:80-89","C:70-79"]
["Dil Tazminatı Oranları",0,1200,900,600,300]
["Yan Ödeme Unvanları1","Müdür-","Müdür-","Müdür-","Müdür-","Müdür-","Müdür-","Müdür-","Müdür-","Müdür-","Müdür-","Müdür-","Müdür Yrd.-","Müdür Yrd.-","Müdür Yrd.-","Müdür Yrd.-","Müdür Yrd.-","Müdür Yrd.-","Müdür Yrd.-","Müdür Yrd.-","Müdür Yrd.-","Müdür Yrd.-","Öğretmen-","Öğretmen-","Öğretmen-","Öğretmen-","Öğretmen-","Öğretmen-","Atölye Şefi-","Bölüm Şefi-","Laboratuvar Şefi-"]
["Yan Ödeme Unvanları2","Azınlık Okulları","Çıraklık Eğitim Merkezi","Fen Liselerinde","Halk Eğitim Merkezi","Hizmetiçi Eğt.Ens.ve Yüksekokullar","İlköğretim Okulları","Mesleki ve Teknik Eğt.","Ortaöğretim Okulları","Öz.Eğt.Muh.Ço. Mahsus Ok.(Alt Sınıflar Dahil)","Rehberlik Merkezi","YİBO","Azınlık Okulları","Çıraklık Eğitim Merkezi","Fen Liselerinde","Halk Eğitim Merkezi","Hizmetiçi Eğt.Ens.ve Yüksekokullar","İlköğretim Okulları","Mesleki ve Teknik Eğt.","Ortaöğretim Okulları","Öz.Eğt.Muh.Ço. Mahsus Ok.(Alt Sınıflar Dahil)","Rehberlik Merkezi","(Bunların Dışında)","Belleticilik Görevi Verilen","Ceza Evinde Görevli","Fen Liselerinde Y.Dil ve Fen Grubu Öğretmeni","Öz.Eğt.Muh.Ço. Mahsus Ok.(Alt Sınıflar Dahil)","Y.Dil Dışındaki Dersleri Y.Dille Okutan","Mesleki ve Teknik Okullarda","Mesleki ve Teknik Okullarda","Mesleki ve Teknik Okullarda"]
["Yan Ödeme Unvanları3",{"$f":"CONCATENATE(B22,B23)","v":"Müdür-Azınlık Okulları"},{"$f":"CONCATENATE(C22,C23)","v":"Müdür-Çıraklık Eğitim Merkezi"},"Müdür-Fen Liselerinde","Müdür-Halk Eğitim Merkezi","Müdür-Hizmetiçi Eğt.Ens.ve Yüksekokullar","Müdür-İlköğretim Okulları","Müdür-Mesleki ve Teknik Eğt.","Müdür-Ortaöğretim Okulları","Müdür-Öz.Eğt.Muh.Ço. Mahsus Ok.(Alt Sınıflar Dahil)","Müdür-Rehberlik Merkezi","Müdür-YİBO","Müdür Yrd.-Azınlık Okulları","Müdür Yrd.-Çıraklık Eğitim Merkezi","Müdür Yrd.-Fen Liselerinde","Müdür Yrd.-Halk Eğitim Merkezi","Müdür Yrd.-Hizmetiçi Eğt.Ens.ve Yüksekokullar","Müdür Yrd.-İlköğretim Okulları","Müdür Yrd.-Mesleki ve Teknik Eğt.","Müdür Yrd.-Ortaöğretim Okulları","Müdür Yrd.-Öz.Eğt.Muh.Ço. Mahsus Ok.(Alt Sınıflar Dahil)","Müdür Yrd.-Rehberlik Merkezi","Öğretmen-(Bunların Dışında)","Öğretmen-Belleticilik Görevi Verilen","Öğretmen-Ceza Evinde Görevli","Öğretmen-Fen Liselerinde Y.Dil ve Fen Grubu Öğretmeni","Öğretmen-Öz.Eğt.Muh.Ço. Mahsus Ok.(Alt Sınıflar Dahil)","Öğretmen-Y.Dil Dışındaki Dersleri Y.Dille Okutan","Atölye Şefi-Mesleki ve Teknik Okullarda","Bölüm Şefi-Mesleki ve Teknik Okullarda","Laboratuvar Şefi-Mesleki ve Teknik Okullarda"]
["İş Güçlüğü Katsayıları",925,925,925,925,975,925,925,925,925,925,925,900,900,900,900,925,900,900,900,900,900,500,600,500,500,700,500,725,725,725]
["İş Riski Katsayıları",250,250,250,250,250,250,250,250,250,250,250,250,250,250,250,250,250,250,250,250,250,250,250,450,250,250,250,250,250,250]
["İş Temini Katsayıları",0,0,500,0,0,0,0,0,250,0,250,0,0,500,0,0,0,0,0,250,0,0,0,0,500,250,500,0,0,0]
["Özel Hizmet Tazminatı (Eğt.Süresi)",0,"2 Yıllık-","2 Yıllık-","2 Yıllık-","2 Yıllık-","2 Yıllık-","2 Yıllık-","2 Yıllık-","2 Yıllık-","2 Yıllık-","2 Yıllık-","2 Yıllık-","2 Yıllık-","2 Yıllık-","2 Yıllık-","2 Yıllık-","2 Yıllık-","2 Yıllık-","2 Yıllık-","2 Yıllık-","2 Yıllık-","2 Yıllık-","2 Yıllık-","2 Yıllık-","2 Yıllık-","2 Yıllık-","2 Yıllık-","2 Yıllık-","2 Yıllık-","2 Yıllık-","2 Yıllık-","2 Yıllık-","2 Yıllık-","2 Yıllık-","2 Yıllık-","2 Yıllık-","2 Yıllık-","2 Yıllık-","2 Yıllık-","2 Yıllık-","2 Yıllık-","2 Yıllık-","2 Yıllık-","2 Yıllık-","2 Yıllık-","2 Yıllık-","2 Yıllık-","2 Yıllık-","2 Yıllık-","2 Yıllık-","2 Yıllık-","2 Yıllık-","2 Yıllık-","2 Yıllık-","2 Yıllık-","2 Yıllık-","2 Yıllık-","2 Yıllık-","2 Yıllık-","2 Yıllık-","2 Yıllık-","2 Yıllık-","2 Yıllık-","2 Yıllık-","2 Yıllık-","2 Yıllık-","2 Yıllık-","2 Yıllık-","2 Yıllık-","2 Yıllık-","2 Yıllık-","2 Yıllık-","2 Yıllık-","2 Yıllık-","2 Yıllık-","2 Yıllık-","2 Yıllık-","2 Yıllık-","2 Yıllık-","2 Yıllık-","2 Yıllık-","2 Yıllık-","2 Yıllık-","2 Yıllık-","2 Yıllık-","2 Yıllık-","2 Yıllık-","2 Yıllık-","2 Yıllık-","2 Yıllık-","2 Yıllık-","2 Yıllık-","2 Yıllık-","2 Yıllık-","2 Yıllık-","2 Yıllık-","2 Yıllık-","2 Yıllık-","4 Yıllık","4 Yıllık","4 Yıllık","4 Yıllık","4 Yıllık","4 Yıllık","4 Yıllık","4 Yıllık","4 Yıllık","4 Yıllık","4 Yıllık","4 Yıllık","4 Yıllık","4 Yıllık","4 Yıllık","4 Yıllık","4 Yıllık","4 Yıllık","4 Yıllık","4 Yıllık","4 Yıllık","4 Yıllık","4 Yıllık","4 Yıllık","4 Yıllık","4 Yıllık","4 Yıllık","4 Yıllık","4 Yıllık","4 Yıllık","4 Yıllık","4 Yıllık","4 Yıllık","4 Yıllık","4 Yıllık","4 Yıllık","4 Yıllık","4 Yıllık","4 Yıllık","4 Yıllık","4 Yıllık","4 Yıllık","4 Yıllık","4 Yıllık","4 Yıllık","4 Yıllık","4 Yıllık","4 Yıllık","4 Yıllık","4 Yıllık","4 Yıllık","4 Yıllık","4 Yıllık","4 Yıllık","4 Yıllık","4 Yıllık","4 Yıllık","4 Yıllık","4 Yıllık","4 Yıllık","4 Yıllık","4 Yıllık","4 Yıllık","4 Yıllık","4 Yıllık","4 Yıllık","4 Yıllık","4 Yıllık","4 Yıllık","4 Yıllık","4 Yıllık","4 Yıllık","4 Yıllık","4 Yıllık","4 Yıllık","4 Yıllık","4 Yıllık","4 Yıllık","4 Yıllık","4 Yıllık","4 Yıllık","4 Yıllık","4 Yıllık","4 Yıllık","4 Yıllık","4 Yıllık","4 Yıllık","4 Yıllık","4 Yıllık","4 Yıllık","4 Yıllık","4 Yıllık","4 Yıllık","4 Yıllık","4 Yıllık","4 Yıllık","4 Yıllık"]
["Özel Hizmet Tazminatı (Alan)","Hiçbiri","Ağaç İşleri","Aile Ekonomisi-Beslenme","Alt Yapı","Ayakkabıcılık","Besin Endüstrisi","Besin Teknolojisi","Bilgisayar","Bilgisayar Bakımı Ve Onarımı-İşletme","Cam İşlemeciliği","Ciltleme Ve Seriografi","Çiçek Örgü Dokuma","Çocuk Gelişimi Ve Bakımı","Çocuk Gelişimi Ve Eğitimi","Daktilo-Muhasebe","Dekoratif Sanatlar","Deri Hazır Giyim","Deri İşlemeciliği","Diş Protez","Dizgi","Döküm-İzabe","Ekonomi Grubu","El Sanatları","El Sanatları-Çiçek","Elektrik","Elektro Mekanik Taşıyıcılar (Asansör)","Elektronik","Endüstriyel Boya Dekorasyon","Endüstriyel Elektronik","Ev Ekonomisi-Beslenme","Ev Yönetimi-Beslenme","Fotoğraf Ve Klişe","Gazetecilik","Gemi Elektroniği Ve Haberleşme","Gemi Makineleri","Gemicilik","Gıda Hazırlama-Aşçılık","Giyim (Biçki Dikiş)","Giyim Ve Ev Aksesuarları","Grafik","Güverte-Güverte Avlama","Halıcılık","Halıcılık Kursu","Harita Ve Kadastro","Hazır Giyim (Konfeksiyon)","İş Makineleri","İş Teknik","İşletme Bilgisi","İşletme-Muhasebe","Kafeterya İşletmeciliği","Kalıpçılık","Kimya","Kooperatif","Kuaförlük","Kurs Öğretmenliği","Kütüphanecilik","Maden","Makine","Makine Ressamlığı","Matbaa","Metal İşleri","Metalürji","Mikro Teknoloji","Mobilya Ve Dekorasyon","Moda Tasarım","Model","Motor","Muhasebe Grubu","Nakış (I.D.O.)-Nakış","Otomatik Kumanda","Petro-Kimya","Plastik Sanatlar-Lastik Teknolojisi;","Radyo Televizyon;","Resim","Restorasyon","Sekreterlik Grubu","Seramik","Seramik Sanatı","Sıhhi Tesisat-Tesisat","Su Ürünleri","Süsleme Taşçılığı;","Teknik Resim;","Tekstil Boya-Baskı Desen","Tekstil Dokuma","Tekstil İplikçilik-İplik","Tekstil Kalite Kontrol","Tekstil Örme","Telekomünikasyon","Terzilik","Tesviye","Ticaret Grubu","Tipo Baskı-Ofset Baskı","Trikotaj","Turizm Ve Otelcilik Grubu","Uygulama Anaokulu Öğretmenliği (Uygulama Sınıfı Verilebilenler);","Üst Yapı","Yapı (İnşaat)","Yapı Ressamlığı","Ağaç İşleri","Aile Ekonomisi-Beslenme","Alt Yapı","Ayakkabıcılık","Besin Endüstrisi","Besin Teknolojisi","Bilgisayar","Bilgisayar Bakımı Ve Onarımı-İşletme","Cam İşlemeciliği","Ciltleme Ve Seriografi","Çiçek Örgü Dokuma","Çocuk Gelişimi Ve Bakımı","Çocuk Gelişimi Ve Eğitimi","Daktilo-Muhasebe","Dekoratif Sanatlar","Deri Hazır Giyim","Deri İşlemeciliği","Diş Protez","Dizgi","Döküm-İzabe","Ekonomi Grubu","El Sanatları","El Sanatları-Çiçek","Elektrik","Elektro Mekanik Taşıyıcılar (Asansör)","Elektronik","Endüstriyel Boya Dekorasyon","Endüstriyel Elektronik","Ev Ekonomisi-Beslenme","Ev Yönetimi-Beslenme","Fotoğraf Ve Klişe","Gazetecilik","Gemi Elektroniği Ve Haberleşme","Gemi Makineleri","Gemicilik","Gıda Hazırlama-Aşçılık","Giyim (Biçki Dikiş)","Giyim Ve Ev Aksesuarları","Grafik","Güverte-Güverte Avlama","Halıcılık","Halıcılık Kursu","Harita Ve Kadastro","Hazır Giyim (Konfeksiyon)","İş Makineleri","İş Teknik","İşletme Bilgisi","İşletme-Muhasebe","Kafeterya İşletmeciliği","Kalıpçılık","Kimya","Kooperatif","Kuaförlük","Kurs Öğretmenliği","Kütüphanecilik","Maden","Makine","Makine Ressamlığı","Matbaa","Metal İşleri","Metalürji","Mikro Teknoloji","Mobilya Ve Dekorasyon","Moda Tasarım","Model","Motor","Muhasebe Grubu","Nakış (I.D.O.)-Nakış","Otomatik Kumanda","Petro-Kimya","Plastik Sanatlar-Lastik Teknolojisi;","Radyo Televizyon;","Resim","Restorasyon","Sekreterlik Grubu","Seramik","Seramik Sanatı","Sıhhi Tesisat-Tesisat","Su Ürünleri","Süsleme Taşçılığı;","Teknik Resim;","Tekstil Boya-Baskı Desen","Tekstil Dokuma","Tekstil İplikçilik-İplik","Tekstil Kalite Kontrol","Tekstil Örme","Telekomünikasyon","Terzilik","Tesviye","Ticaret Grubu","Tipo Baskı-Ofset Baskı","Trikotaj","Turizm Ve Otelcilik Grubu","Uygulama Anaokulu Öğretmenliği (Uygulama Sınıfı Verilebilenler);","Üst Yapı","Yapı (İnşaat)","Yapı Ressamlığı"]
["Özel Hizmet Tazminatı (Alan-Eğt.Süresi)","Hiçbiri",{"$f":"CONCATENATE(C28,C29)","v":"2 Yıllık-Ağaç İşleri"},{"$f":"CONCATENATE(D28,D29)","v":"2 Yıllık-Aile Ekonomisi-Beslenme"},"2 Yıllık-Alt Yapı","2 Yıllık-Ayakkabıcılık","2 Yıllık-Besin Endüstrisi","2 Yıllık-Besin Teknolojisi","2 Yıllık-Bilgisayar","2 Yıllık-Bilgisayar Bakımı Ve Onarımı-İşletme","2 Yıllık-Cam İşlemeciliği","2 Yıllık-Ciltleme Ve Seriografi","2 Yıllık-Çiçek Örgü Dokuma","2 Yıllık-Çocuk Gelişimi Ve Bakımı","2 Yıllık-Çocuk Gelişimi Ve Eğitimi","2 Yıllık-Daktilo-Muhasebe","2 Yıllık-Dekoratif Sanatlar","2 Yıllık-Deri Hazır Giyim","2 Yıllık-Deri İşlemeciliği","2 Yıllık-Diş Protez","2 Yıllık-Dizgi","2 Yıllık-Döküm-İzabe","2 Yıllık-Ekonomi Grubu","2 Yıllık-El Sanatları","2 Yıllık-El Sanatları-Çiçek","2 Yıllık-Elektrik","2 Yıllık-Elektro Mekanik Taşıyıcılar (Asansör)","2 Yıllık-Elektronik","2 Yıllık-Endüstriyel Boya Dekorasyon","2 Yıllık-Endüstriyel Elektronik","2 Yıllık-Ev Ekonomisi-Beslenme","2 Yıllık-Ev Yönetimi-Beslenme","2 Yıllık-Fotoğraf Ve Klişe","2 Yıllık-Gazetecilik","2 Yıllık-Gemi Elektroniği Ve Haberleşme","2 Yıllık-Gemi Makineleri","2 Yıllık-Gemicilik","2 Yıllık-Gıda Hazırlama-Aşçılık","2 Yıllık-Giyim (Biçki Dikiş)","2 Yıllık-Giyim Ve Ev Aksesuarları","2 Yıllık-Grafik","2 Yıllık-Güverte-Güverte Avlama","2 Yıllık-Halıcılık","2 Yıllık-Halıcılık Kursu","2 Yıllık-Harita Ve Kadastro","2 Yıllık-Hazır Giyim (Konfeksiyon)","2 Yıllık-İş Makineleri","2 Yıllık-İş Teknik","2 Yıllık-İşletme Bilgisi","2 Yıllık-İşletme-Muhasebe","2 Yıllık-Kafeterya İşletmeciliği","2 Yıllık-Kalıpçılık","2 Yıllık-Kimya","2 Yıllık-Kooperatif","2 Yıllık-Kuaförlük","2 Yıllık-Kurs Öğretmenliği","2 Yıllık-Kütüphanecilik","2 Yıllık-Maden","2 Yıllık-Makine","2 Yıllık-Makine Ressamlığı","2 Yıllık-Matbaa","2 Yıllık-Metal İşleri","2 Yıllık-Metalürji","2 Yıllık-Mikro Teknoloji","2 Yıllık-Mobilya Ve Dekorasyon","2 Yıllık-Moda Tasarım","2 Yıllık-Model",{"$f":"CONCATENATE(BP28,BP29)","v":"2 Yıllık-Motor"},"2 Yıllık-Muhasebe Grubu","2 Yıllık-Nakış (I.D.O.)-Nakış","2 Yıllık-Otomatik Kumanda","2 Yıllık-Petro-Kimya","2 Yıllık-Plastik Sanatlar-Lastik Teknolojisi;","2 Yıllık-Radyo Televizyon;","2 Yıllık-Resim","2 Yıllık-Restorasyon","2 Yıllık-Sekreterlik Grubu","2 Yıllık-Seramik","2 Yıllık-Seramik Sanatı","2 Yıllık-Sıhhi Tesisat-Tesisat","2 Yıllık-Su Ürünleri","2 Yıllık-Süsleme Taşçılığı;","2 Yıllık-Teknik Resim;","2 Yıllık-Tekstil Boya-Baskı Desen","2 Yıllık-Tekstil Dokuma","2 Yıllık-Tekstil İplikçilik-İplik","2 Yıllık-Tekstil Kalite Kontrol","2 Yıllık-Tekstil Örme","2 Yıllık-Telekomünikasyon","2 Yıllık-Terzilik","2 Yıllık-Tesviye","2 Yıllık-Ticaret Grubu","2 Yıllık-Tipo Baskı-Ofset Baskı","2 Yıllık-Trikotaj","2 Yıllık-Turizm Ve Otelcilik Grubu","2 Yıllık-Uygulama Anaokulu Öğretmenliği (Uygulama Sınıfı Verilebilenler);","2 Yıllık-Üst Yapı","2 Yıllık-Yapı (İnşaat)","2 Yıllık-Yapı Ressamlığı","4 YıllıkAğaç İşleri","4 YıllıkAile Ekonomisi-Beslenme","4 YıllıkAlt Yapı","4 YıllıkAyakkabıcılık","4 YıllıkBesin Endüstrisi","4 YıllıkBesin Teknolojisi","4 YıllıkBilgisayar","4 YıllıkBilgisayar Bakımı Ve Onarımı-İşletme","4 YıllıkCam İşlemeciliği","4 YıllıkCiltleme Ve Seriografi","4 YıllıkÇiçek Örgü Dokuma","4 YıllıkÇocuk Gelişimi Ve Bakımı","4 YıllıkÇocuk Gelişimi Ve Eğitimi","4 YıllıkDaktilo-Muhasebe","4 YıllıkDekoratif Sanatlar","4 YıllıkDeri Hazır Giyim","4 YıllıkDeri İşlemeciliği","4 YıllıkDiş Protez","4 YıllıkDizgi","4 YıllıkDöküm-İzabe","4 YıllıkEkonomi Grubu","4 YıllıkEl Sanatları","4 YıllıkEl Sanatları-Çiçek","4 YıllıkElektrik","4 YıllıkElektro Mekanik Taşıyıcılar (Asansör)","4 YıllıkElektronik","4 YıllıkEndüstriyel Boya Dekorasyon","4 YıllıkEndüstriyel Elektronik","4 YıllıkEv Ekonomisi-Beslenme","4 YıllıkEv Yönetimi-Beslenme","4 YıllıkFotoğraf Ve Klişe","4 YıllıkGazetecilik",{"$f":"CONCATENATE(EB28,EB29)","v":"4 YıllıkGemi Elektroniği Ve Haberleşme"},"4 YıllıkGemi Makineleri","4 YıllıkGemicilik","4 YıllıkGıda Hazırlama-Aşçılık","4 YıllıkGiyim (Biçki Dikiş)","4 YıllıkGiyim Ve Ev Aksesuarları","4 YıllıkGrafik","4 YıllıkGüverte-Güverte Avlama","4 YıllıkHalıcılık","4 YıllıkHalıcılık Kursu","4 YıllıkHarita Ve Kadastro","4 YıllıkHazır Giyim (Konfeksiyon)","4 Yıllıkİş Makineleri","4 Yıllıkİş Teknik","4 Yıllıkİşletme Bilgisi","4 Yıllıkİşletme-Muhasebe","4 YıllıkKafeterya İşletmeciliği","4 YıllıkKalıpçılık","4 YıllıkKimya","4 YıllıkKooperatif","4 YıllıkKuaförlük","4 YıllıkKurs Öğretmenliği","4 YıllıkKütüphanecilik","4 YıllıkMaden","4 YıllıkMakine","4 YıllıkMakine Ressamlığı","4 YıllıkMatbaa","4 YıllıkMetal İşleri","4 YıllıkMetalürji","4 YıllıkMikro Teknoloji","4 YıllıkMobilya Ve Dekorasyon","4 YıllıkModa Tasarım","4 YıllıkModel","4 YıllıkMotor","4 YıllıkMuhasebe Grubu","4 YıllıkNakış (I.D.O.)-Nakış","4 YıllıkOtomatik Kumanda","4 YıllıkPetro-Kimya","4 YıllıkPlastik Sanatlar-Lastik Teknolojisi;","4 YıllıkRadyo Televizyon;","4 YıllıkResim","4 YıllıkRestorasyon","4 YıllıkSekreterlik Grubu","4 YıllıkSeramik","4 YıllıkSeramik Sanatı","4 YıllıkSıhhi Tesisat-Tesisat","4 YıllıkSu Ürünleri","4 YıllıkSüsleme Taşçılığı;","4 YıllıkTeknik Resim;","4 YıllıkTekstil Boya-Baskı Desen","4 YıllıkTekstil Dokuma","4 YıllıkTekstil İplikçilik-İplik","4 YıllıkTekstil Kalite Kontrol","4 YıllıkTekstil Örme","4 YıllıkTelekomünikasyon","4 YıllıkTerzilik","4 YıllıkTesviye","4 YıllıkTicaret Grubu","4 YıllıkTipo Baskı-Ofset Baskı","4 YıllıkTrikotaj","4 YıllıkTurizm Ve Otelcilik Grubu","4 YıllıkUygulama Anaokulu Öğretmenliği (Uygulama Sınıfı Verilebilenler);","4 YıllıkÜst Yapı","4 YıllıkYapı (İnşaat)",{"$f":"CONCATENATE(GN28,GN29)","v":"4 YıllıkYapı Ressamlığı"}]
{"$rows_left_out":4}
{"sheet":"Özel Hizmet Tazminatları","index":3,"n_rows":194,"n_cols":3,"rows_kept":194,"cut":false,"hidden":true,"merged":[]}
["2 Yıllık-","Ağaç İşleri",8]
["2 Yıllık-","Aile Ekonomisi-Beslenme",6]
["2 Yıllık-","Alt Yapı",8]
["2 Yıllık-","Ayakkabıcılık",7]
["2 Yıllık-","Besin Endüstrisi",6]
["2 Yıllık-","Besin Teknolojisi",6]
["2 Yıllık-","Bilgisayar",10]
["2 Yıllık-","Bilgisayar Bakımı Ve Onarımı-İşletme",10]
["2 Yıllık-","Cam İşlemeciliği",7]
["2 Yıllık-","Ciltleme Ve Seriografi",8]
["2 Yıllık-","Çiçek Örgü Dokuma",6]
["2 Yıllık-","Çocuk Gelişimi Ve Bakımı",4]
["2 Yıllık-","Çocuk Gelişimi Ve Eğitimi",4]
["2 Yıllık-","Daktilo-Muhasebe",4]
["2 Yıllık-","Dekoratif Sanatlar",6]
["2 Yıllık-","Deri Hazır Giyim",6]
["2 Yıllık-","Deri İşlemeciliği",7]
["2 Yıllık-","Diş Protez",7]
["2 Yıllık-","Dizgi",8]
["2 Yıllık-","Döküm-İzabe",10]
["2 Yıllık-","Ekonomi Grubu",4]
["2 Yıllık-","El Sanatları",6]
["2 Yıllık-","El Sanatları-Çiçek",6]
["2 Yıllık-","Elektrik",10]
["2 Yıllık-","Elektro Mekanik Taşıyıcılar (Asansör)",10]
["2 Yıllık-","Elektronik",10]
["2 Yıllık-","Endüstriyel Boya Dekorasyon",8]
["2 Yıllık-","Endüstriyel Elektronik",10]
["2 Yıllık-","Ev Ekonomisi-Beslenme",6]
["2 Yıllık-","Ev Yönetimi-Beslenme",6]
{"$rows_left_out":165}
{"sheet":"SGY","index":4,"n_rows":23,"n_cols":13,"rows_kept":23,"cut":false,"hidden":true,"merged":[[18,11,18,12],[7,7,8,7],[7,8,8,8],[9,11,9,12],[10,11,10,12],[11,11,11,12],[12,11,12,12],[6,11,8,12],[6,0,8,0],[6,1,8,1],[6,2,8,2],[13,11,13,12],[14,11,14,12],[7,3,8,3],[7,4,8,4],[7,5,8,5],[7,6,8,6],[0,1,0,2],[4,1,4,2],[5,1,5,2],[0,11,3,11],[0,12,3,12],[1,1,1,2],[2,1,2,2],[3,1,3,2]]}
["Adı Soyadı","Selamet EKİN",null,null,"YURTİÇİ SÜREKLİ GÖREV YOLLUĞU BİLDİRİMİ",null,null,null,null,null,null,"Birimi","Boğazkent Nurten-Turan Kilit Ortaokulu"]
["TC Kimlik No",{"$f":"VLOOKUP(B1,#REF!,2,FALSE)","v":{"$error":"#REF!"}}]
["Saymanlık No",{"$f":"VLOOKUP(B1,#REF!,7,FALSE)","v":{"$error":"#REF!"}}]
["Ünvanı/Görevi",{"$f":"CONCATENATE(VLOOKUP(B1,#REF!,4,FALSE),\"/\",VLOOKUP(SGY!B1,#REF!,5,FALSE))","v":{"$error":"#REF!"}},{"$f":"CONCATENATE(VLOOKUP(C1,#REF!,4,FALSE),\"/\",VLOOKUP(#REF!,#REF!,5,FALSE))","v":{"$error":"#REF!"}}]
["Aylık Kadro Derecesi","1/4",null,null,null,null,null,null,null,null,null,"Bütçe Yılı",{"$f":"YEAR((TODAY()))","v":2024}]
["Gündeliği",{"$f":"Veriler!C1","v":37.25},null,null,null,null,null,null,null,null,null,"Atama Tarihi","2017-07-26"]
["Nereden Nereye Gidildiği","Adı Soyadı","Yakınlık derecesi","GÜNDELİK",null,null,"YOL MASRAFI",null,"YER DEĞİŞTİRME MASRAFI",null,null,"Toplam Tutar"]
[null,null,null,"Gün Sayısı","Gündelik","Tutarı","Çeşidi/Mevkii","Ücreti","Sabit Unsur","Değişken Unsur (%5)"]
[null,null,null,null,null,null,null,null,null,"Mesafe","Tutarı"]
["Serik-İzmir","Ergun ÖĞMEN","Kendisi",1,{"$f":"$B$6","v":37.25},{"$f":"PRODUCT(D10:E10)","v":37.25},"Mutat Vasıta",40,{"$f":"PRODUCT(E10,20)","v":745},400,{"$f":"PRODUCT(J10,PRODUCT(E10,5%))","v":745},{"$f":"SUM(F10,H10,I10,K10,)","v":1567.25}]
["Serik-İzmir","Derya ÖĞMEN","Eşi",1,{"$f":"$B$6","v":37.25},{"$f":"PRODUCT(D11:E11)","v":37.25},"Mutat Vasıta",40,{"$f":"PRODUCT(E10,10)","v":372.5},null,null,{"$f":"SUM(F11,H11,I11,K11,)","v":449.75}]
["Serik-İzmir","Direnç ÖĞMEN","Çocuğu",1,37.25,37.25,"Mutat Vasıta",40,{"$f":"PRODUCT(E10,10)","v":372.5},null,null,449.75]
["Serik-İzmir","Alkım ÖĞMEN","Çocuğu",1,37.25,37.25,"Mutat Vasıta",40,{"$f":"PRODUCT(E11,10)","v":372.5},null,null,449.75]
[]
[null,null,null,null,null,null,null,null,null,"Genel Toplam",null,{"$f":"SUM(L10:M14)","v":2916.5}]
[]
["Antalya Serik Boğazkent Nurten-Turan Kilit Ortaokulundan Antalya Kepez Hızır Reis Ticaret Meslek Lisesine atanan Ergun ÖĞMEN ve aile fertlerine ait yurtiçi sürekli görev yolluğu olarak"]
["tahakkuk eden Binüçyüzaltmışbir lira doksanüç kuruşu gösterir bildirimdir."]
[null,null,null,null,null,null,null,null,null,null,null,"2017-06-25"]
[null,null,null,null,null,null,null,null,"Bildirim Sahibi",null,null,"Birim Yetkilisi"]
[null,null,null,null,null,null,"Adı Soyadı",":",null,null,null,"Mahmut YILDIZ"]
[null,null,null,null,null,null,"Görevi",":",null,null,null,"Okul Müdürü"]
[null,null,null,null,null,null,"İmzası",":"]

{"sheet":"Veriler","index":5,"n_rows":13,"n_cols":23,"rows_kept":13,"cut":false,"hidden":true,"merged":[[0,9,2,9],[6,9,7,9],[6,10,6,22]]}
["Kendisi",0.33333333333333331,37.25,null,null,null,null,null,null,"H Cetveli",null,"2013-1","2013-2","2014-1","2014-2","2015-1","2015-2","2016-1","2016-2","2017-1"]
["Eşi",0.66666666666666663,null,null,null,null,null,null,null,null,"1-4",29.5,null,null,null,null,null,null,null,37.25]
["Çocuğu",1,null,null,null,null,null,null,null,null,"5-15",28.5]
["Babası",2]
["Annesi",3]
[null,4]
[null,5,null,null,null,null,null,null,null,"MERKEZİ YÖNETİM BÜTÇE KANUNU H CETVELİ","YILLAR"]
[null,6,null,null,null,null,null,null,null,null,2002,2003,2004,2005,2006,2007,2008,2009,2010,2011,2012,2013,2014]
[null,7,null,null,null,null,null,null,null,"a) Ek göstergesi 8000 ve daha yüksek olan kadrolarda bulunanlar (1)",13,16,20,24,25.5,28,29.5,31.5,33,34.5]
[null,8,null,null,null,null,null,null,null,"b) Ek göstergesi 5800 ( dahil )-8000 ( hariç ) olan kadrolarda bulunanlar (2)",11,14,18,21.6,23,25,26.5,28.5,30,31.5]
[null,9,null,null,null,null,null,null,null,"c) Ek göstergesi 3000 ( dahil )-5800 ( hariç ) olan kadrolarda bulunanlar ",10,13,16,19.2,20.5,22.5,24,26,27.5,29]
[null,10,null,null,null,null,null,null,null,"d) Aylık / kadro derecesi 1-4 olanlar,",9,11,14,16.8,18,20,21.5,23.5,25,26.5]
[null,null,null,null,null,null,null,null,null,"e) Aylık / kadro derecesi 5-15 olanlar,",8,10,13,15.6,17,19,20,22.5,24,25.5]

{"sheet":"Bordro","index":6,"n_rows":21,"n_cols":11,"rows_kept":21,"cut":false,"hidden":false,"merged":[[20,9,20,10],[19,9,19,10],[18,9,18,10],[17,9,17,10],[9,9,9,10],[10,9,10,10],[11,9,11,10],[12,9,12,10],[13,7,13,8],[13,9,13,10],[7,3,8,3],[7,4,8,4],[7,5,8,5],[7,6,8,6],[7,7,8,7],[7,8,8,8],[6,9,8,10],[0,2,0,8],[0,9,2,9],[0,10,2,10],[3,9,5,9],[3,10,5,10],[19,3,19,5],[20,3,20,5],[6,0,8,0],[6,1,8,1],[6,2,6,3],[18,3,18,5],[7,2,8,2]]}
["Adı Soyadı","dgdfg","YURTİÇİ GEÇİCİ GÖREV YOLLUĞU BİLDİRİMİ",null,null,null,null,null,null,"Birimi","15 Temmuz Şehitleri Ortaokulu Ortaokulu"]
["TC Kimlik No","tfhtyhf"]
["Saymanlık No","fgh"]
["Ünvanı/Görevi","Öğretmen/Okul Müdürü",null,null,null,null,null,null,null,"Bütçe Yılı",2024]
["Derece/Kademesi","1/4  Ek gösterge:3000"]
["Gündeliği"]
["Yolculuk ve Oturma Tarihleri","Nereden Nereye Gidildiği","Hareket Saatleri",null,"GÜNDELİK",null,null,"YOL MASRAFI",null,"Toplam Tutar"]
[null,null,"Gidiş","Dönüş","Gün Sayısı","Gündelik","Tutarı","Çeşidi/Mevkii","Ücreti"]
[]
["2022-05-18","Gidiş: Serik-Aksu\nDönüş: Aksu-Serik","08.30","15.30",0.33333333333333331,{"$f":"$B$6","v":0},{"$f":"PRODUCT(E10,F10)","v":0},"Mutat Vasıta",36,{"$f":"SUM(G10,I10)","v":36}]
[null,null,null,null,null,null,null,null,null,{"$f":"SUM(G11,I11)","v":0}]
[null,null,null,null,null,null,null,null,null,0]
[null,null,null,null,null,null,null,null,null,0]
[null,null,null,null,null,null,null,"GENEL TOPLAM",null,{"$f":"SUM(J10:K13)","v":36}]
[]
[{"$f":"CONCATENATE(\"Yukarıdaki tarih ve saatler arasında yapmış olduğum göreve ait \"&ParaCevir(J14)&\"harcamaya ait bildirimdir.\")","v":"Yukarıdaki tarih ve saatler arasında yapmış olduğum göreve ait Otuzaltı Lira harcamaya ait bildirimdir."}]
[]
[null,null,null,null,null,null,null,null,null,"2024-01-01"]
[null,null,null,"Bildirim Sahibi",null,null,null,null,null,"Birim Yetkilisi"]
[null,"Adı Soyadı",":","Aaaaaa BBBBBBBBBB",null,null,null,"Adı Soyadı",":","Aaaaaa BBBBBBBBBB"]
[null,"Görevi",":","Türkçe Öğretmeni",null,null,null,"Görevi",":","Okul Müdürü"]